Hot questions for Cucumber

Categories Question List
Using Cucumber in allure How to get the Cucumber steps and attachments in Allure report?
Cucumber-JVM 3 - Allure 2 Test Report with Maven
How standard settings suppose to be in build.gradle if use Cucumber JVM and Allure?
Using Cucumber in android Executing Cucumber Tests Using Maven
How to make Cucumber features run in an Android project as local unit tests?
Cucumber tests invoked not in sequence in Android
How to reuse a method from another step definition class Appium/Cucumber/Java
Gradle for Android: Why doesn't javaexec pick up my classpath?
Invoking UI Elements with Appium in Cucumber tests in Java Android results in build failed with alot of logs
Using Cucumber in appium How to make ignored junit steps in cucumber-jvm cause test scenario to fail
Is there any Alternative of --guess in java runcukes
Possibilities on integrating existing cucumber framework with appium
AWS Device Farm - Not a file or directory for cucumber features path
Cucumber JVM Junit Runner cucumber api does not exist
How to make Appium clean app before scenario
Using Cucumber in automated tests Is it possible to make cucumber test fail?
How can I refresh a folder with Java code?
Cucumber Selenium - fill in web form
Tests are not being executed for TestNG
Using Java objects for Cucumber testing
@beforetest testng its being ignored for some reason
Is it possible to use wildcard logic '*' to list a specific directory via Apache Maven Goals & Options?
automatically run external application, which use Cucumber for testing main application
Using Cucumber in automation How to load Spring application context with Cucumber runner
Cucumber Selenium using Excel File as Data Table
how to add explicit wait in drop down in selenium which is dependent on another Dropdown list?
How to clear the default value entered in calendar box and send a new date of birth
How to compare value in Examples on Scenario Outline versus the Actual value on the Actual page using Cucumber/Selenium/Java
Where I can find a guide to aXe with java?
How can we run cucumber tests via a batch file?
Get value from website but java code does not work. how to fix?
Passing scenario context between multiple step definition classes
Can I create an automation script with Java + Eclipse + Cucumber without creation a marven project?
ResourceBundle can't find BaseName gradle project java
Why is my IE browser getting launched twice with Selenium and Cucumber?
Can cucumber automation testing be used to test Java Applications?
Using Cucumber in citrus framework Asynchronous steps execution with Cucumber (and/or Citrus)
How to inject TestContext using TestRunner and cucumber
How to handle many "Then" step definitions?
citrus-cucumber or citrus/xmlDSL tests
Using Cucumber in command line interface CLI runner cucumber.api.cli.Main cannot find step definitions
How to invoke the Cucumber runner class from a different main method
Using Cucumber in cucumber serenity Serenity BDD fun features by groups
@RunWith(CucumberWithSerenity.class) throws NoClassDefFound cucumber/runtime/junit/Assertions
Configuring @RunWith to use CucumberWithSerenity.class instead of Cucumber.class in IntelliJ runners
How do I get polymorphic tests working with cucumber-jvm, cucumber-serenity and SerenityObjectFactory
Using Cucumber in datatable Cucumber-JVM 3 - io.cucumber.datatable.UndefinedDataTableTypeException
How to convert a HashMap to cucumber dataTable?
Cucumber DataTable Error - io.cucumber.datatable.UndefinedDataTableTypeException: Can't convert DataTable to cucumber.api.DataTable
Cucumber-JVM 3 - Convert DataTable to single object using asMap()
How to convert a DataTable in Cucumber to a List of objects?
Cucumber Java how to update an element in a DataTable
List<Map<String,String>> to iterate through WebElement variables
How to Iterate Datatable with type List<Class> in Cucumber
Cucumber scenario assert condition in DataTable
Cucumber DataTable with two different classes
Datatable in background in cucumber
How to resolve Error java: incompatible types: cucumber.api.DataTable cannot be converted to java.lang.String
Using Cucumber in dependency injection Cucumber - Share context with the type registry configuration file
@FindBy WebElements not initialized when using Guice @Inject
Sharing state between step definitions in Cucumber
Possible to use PicoContainer (Dependency injection) without constructor parameters?
How to effectively use PicoContainer Setter Injection (Use PicoContainer without passing parameters to the constructor)?
Using Cucumber in eclipse Run as cucumber feature not showing in eclipse
How to use cucumber/gherkin in different language?
System.out.println() does not print to the console in Eclipse
Running selective tests from Cucumber BDD Example Section
Error Executing Maven - Non-parseable settings settings.xml
cucmber eclipse plugin in eclipse oxygen
how to specify cucumber tags as invocation param in eclipse debug configuration?
java.lang.NoClassDefFoundError in Cucumber test package
Cucumber error with Eclipse
Serenity Cucumber: tests exit in first fail and report is empty
How to generate steps of cucumber features in STS (Eclipse)?
Why does Maven test not work after mvn clean unless I run mvn update?
Using Cucumber in exception maven surefire verify java.lang.ClassNotFoundException
Cucumber Exception: java.lang.ClassNotFoundException: cucumber.io.ResourceLoader
cucumber AmbiguousStepDefinitionsException Java
Pico container exception: org.picocontainer.injectors.AbstractInjector$UnsatisfiableDependenciesException:?
cucumber.runtime.CucumberException: Couldn't load plugin class: io.qameta.allure.cucumberjvm.AllureCucumberJvm
Getting cucumber.runtime.DuplicateStepDefinitionException despite adding Background in the feature file calc.feature
Java and Cucumber: Strange ambiguous step definition exception
cucumber.runtime.CucumberException: Couldn't load plugin class: json-pretty with Cucumber Selenium and Java
UndefinedStepException when run test using Cucumber JVM
Cucumber StepDef ResultActions NullPointerException
IntelliJ cucumber .ClassNotFoundException
java.lang.ClassNotFoundException: sun.reflect.ConstantPool while running cucumber features
Cannot locate Element that exist, getting NullPointerException instead of NoSuchElement
Cucumber Selenium (Java) - PageFactory - NullPointException getting URL
Getting Null pointer Exception while running cucumber test with selenium webdriver in java
Error when running Cucumber Junit test :Intializationerror
AmbiguousStepDefinitionsException while using Cucumber on Android
Space is Worspace name is causing java.net.URISyntaxException
Getting No Feature Found Exception in Cucumber Test with Selenium
Exception in thread "main" java.lang.NoClassDefFoundError: cucumber/deps/com/thoughtworks/xstream/converters/ConverterRegistry
Selenium Automation - Cucumber and JUnit - No public static parameters method
Run a JUnit test from my java application
java.lang.NullPointerException error On Page Object Model
Index out of Bounds Exception - when comparing two(2) lists of Strings
Using Cucumber in extentreports Cucumber ExtentReport generation with TestNG during multiple thread execution
Extent report is not working in Cucumber 4.7.1
Unable to generate the extent-report
Cucumber Java - ExtentReports - IncompatibleClassChangeError: Implementing class
How do I get Cucumber Extent Reports to work with Cucumber 5.6.0?
Create customize file report name in @CucumberOptions
Using Cucumber in feature file cucumber: how to run specific scenario from a feature file
How to execute cucumber feature file parallel
execute multiple cucumber feature files
How to order feature files in Cucumber test suite?
CustomDataProvider for feature file (QAF)
How to resolve runtime.cucumberexception for error parsing feature file
How to create dynamic glue in cucumber java based on the feature file location?
How to mention Boolean value in 'Examples' in feature file of cucumber and make sure it creates a method in java?
Dynamic Feature File allocation in Cucumber JVM
bad tag error in feature file cucumber/eclipse
Cucumber not serializing date string from datatable in feature file to a LocalDate field inside my pojo
Cucumber how to find if a feature file has executed? Any Java method?
How to mark a feature file with @manualTesting such that scenarios inside it are never run
Use a value in a feature file in a cucumber test?
How to pass arguments to karate feature file from selenium java test file
Unable to run cucumber feature file using gradle in Eclipse. I am getting "Error: Could not find or load main class cucumber.api.cli.Main" error
TestNG & Cucumber: Pass in single feature file name as parameter
All feature files are not executing
Is it possible to pass Java-Enum as argument from cucumber feature file (in a more text friendly way)?
Cucumber Runner doesn't load all feature files using Karate
How to re-use steps in Feature file /Duplicate step definitions/
Running Single cucumber-jvm .feature file from Gradle
Why is my .feature file saying "Undefined step reference", although my cucumber tests run fine and detect the steps?
Java - Maven - Cucumber: Feature file is not able to run
How to target a specific Cucumber Feature File (Automation Test) via Jenkins?
Selenium Cucumber Feature File is Not Enabling in Eclipse
The console does not show any printed output when a feature file is executed
Cucumber for REST, writing feature file when having duplicate steps
Where do I store a integrative feature (file) in multi-modul maven project?
How to write an object inside a table's cell in a feature file?
Cucumber run scenario depends on another from different feature files
How to run one feature file for Android and iOS
feature file ignore the Steps Definition and ignored Test
Cucumber 5: Get step name from feature file excluding gherkin syntax (given, when, then, and)
How to have List of Strings in step definition function instead of number of parameters from gherkin feature file
Executing Java Cucumber feature files one by one from bash script and continue execution of feature files after first one has completed
How do you change the location that Maven reads Cucumber feature files?
cucumber feature file to run in order
Using Cucumber in gradle Run cucumber test with cached dependencies and plugins on gradle
Error: Could not find or load main class cucumber.api.cli.Main
Migrate maven dependencies to gradle
Running Cucumber from different directory using Gradle 5 and Cucumber-JVM
'Gradle cucumber' With testImplementation Not Working
Is there a way to integrate Gradle / Cucumber / Selenium tests into Browserstack (Java)?
Getting jacoco report from cucumber tests with gradle
Passing in tags to Gradle cucumber task
Passing system property to cucumber test via gradle
How add Cucumber tests to a pre-existing Gradle project (Java)?
Using Cucumber in groovy Use same classloader for JUnit and Cucumber
Cucumber on groovy can't cast null to string when looks for step definition
No signature of method for running cucumber test when using cucumber v1.2.4
Xpath query unexpectedly returns 0 in Java/groovy, works in other interpreter
Using Cucumber in hook Cucumber class extending step definitions and hooks
Cucumber-jvm Hooks when Scenario is passed or failed
How to define different behavior for JUnit @Before hook with Maven and Cucumber
AfterAll global hook cucumber-jvm
How to hook Cucumber-Java life cycle
Cucumber-Appium - Where to store Hooks if initialising driver in @Before
Hooks not running in Cucumber 4
Hook up in cucumber check for scenario failure in java
Cucumber 'After' Hook not working?
Dependence injection to initialize driver in cucumber project and use hook without terminating session
How to give priority order for cucumber.io 5.6.0 after hooks and a specific tag
Hooks @Before and @after are called twice in the beginning
Cucumber @Before hook opening multiple browser windows
Cucumber step definition class after hook executes even if step definition class not used?
How to store cucumber scenario hooks (@Before, @After) in different package
How to use hooks with cucumber CLI?
Cucumber hooks are being run, but not the tests
How to get all the cucumber scenario steps in before hook?
How to handle dynamic step in cucumber without AfterStep hook?
How to pass value from testng.xml to hooks java class
Using Cucumber in integration testing How to capture a screenshot after each step in tests with JAVA and Cucumber?
Trying to load different properties for cucumber integration test of Spring Boot App?
Regression component tests with Cucumber. Is there any boundary to the layers that should be tested?
Tag inheritance in cucumber junit
Can't Launch Junit Test with Cucumber due to strange error
Using Cucumber in intellij idea IntelliJ Shorten Command Line for Cucumber Tests
Migrating from info.cukes to io.cucumber shows no steps status when running the test
Cucumber PendingExceprion for test steps in Intellij IDEA
Java: package cucumber.api.junit does not exist
How do I correctly implement PageFactory annotations within Selenium?
@txn ignored when features run via test class
Cucumber Support In IntelliJ Idea Community Edition?
Steps navigation problem in Intellij idea with cucumber 4.6.0
Unable to run simple cucumber program with java and Maven
JUnit error "test framework quit unexpectedly" in Intelij IDEA
Error when running cucumber with java/IntelliJ
Cucumber will not set up in intelliJ - does not seem to recognise Gherkin
path in @CucumberOptions will work in Idea, or mvn verify, but not both
IntelliJ and cucumber not working
Cucumber on IntelliJ: getting errors as soon as I set up new project
Unable to create .feature cucumber file IntelliJ - 'Cannot create class-file'
Cucumber reports not generating
Update Cucumber features and test execution results on Xray in Jira
Using Cucumber in java 8 Java - Gherkin & Cucumber: Pass an object or list of objects on a vertical table instead of horizontal
Unsupported major.minor version 52.0 - trying to look for Java 8, which is already set in Java_home and Path
Cucumber lambdas for other languages
Java 8 Cucumber After and Before using lambda
Java 8 time classes in Cucumber
RestAssured: How can I get the RequestSpecification fields or parameters after sending a request?
Integration test cases not working after jdk10 upgrade
Using Cucumber in jenkins Element is not clickable at point . Other element would receive the click:
Specifying multiple goals in Maven and running them separately
Jenkins Cucumber report send as an Email attachment
Cucumber reports plugin in Bamboo
Cannot assign configuration entry 'tags' with value '"~@ignored"' of type java.lang.String to property of type java.util.List -> [Help 1]
maven build on jenkins not allowing to create/genarte any files in project
How to run failed scenarios from jenkins
Using Cucumber in junit4 @After and @Before annotation is not executing second method
JUnit test is still passing even though sql query should return no records
Using Cucumber in junit5 How to run parallel test jUnit5 in spring boot - cucumber version 5 and more
Selecting a single test with Cucumber JUnit5 engine fails
How do I get the result of a Cucumber feature
Using Cucumber in karate Karate - GraphQL - How to verify schema and then response?
Karate scenario cannot be executed from intellij
Karate conditional background execution
How to use cucumber table when it is code driven
In Karate DSL, How do I verify the field names within the response without caring about what their values are
Adding custom step definitions to Karate framework
Extract only the value and not the column name in SQL with karate dsl
Using Cucumber in pageobjects Instantiating PageObject instances from within Cucumber StepDefinitions
Generics with Cucumber-jvm and Page Objects don't work
How to create generic cucumber step which accepts an argument and verifies page heading of the pageobjects
Execute a method once before testing starts for several features and scenarios
Passing parameters in Data Tables Selenium/Cucumber/Java
Using Cucumber in picocontainer Project doesn't recognize cucumber-picocontainer dependency
Shared WebDriver becomes null on second scenario using PicoContainer
cucumber-picocontainer not registering
Selenium Cucumber Repository (Java) Picocontainer issue
Using Cucumber in qaf Is it possible to migrate from cucumber-jvm to QAF?
Handling excel spreadsheets with Cucumber Scenario Outline
JUnit implementation of QAF
Cucumber Scenario: getSourceTagNames() inconsistently returns list in random order
How can I update Rally test cases automatically using Cucumber and Rally integration?
Stopping the execution if first scenario fails in QAF - Cucumber
Using Cucumber in regex Passing multiple arguments on Cucumber step definition
Regex for step definiton in Cucumber
Regex Error for Cucumber Step Definition
java match string to variable name and pass the variable's value
Cucumber detects to many arguments
Using Cucumber in rest assured How to send String[] and String values on the same API's body using Rest Assured?
How to request a POST API send token and body values using Rest-Assured?
How to search XML node values with the same name and at the same level?
Using Cucumber in selenide Cucumber reports values inside code
How I can attach screenshot of failed Cucumber step to Allure report exactly in step, not in Tear Down section?
Java reflections method to get annotated field as SelenideElement
Using Cucumber in serenity bdd Cucumber step doesn't recognize String
How to check if all elements of a PageObject are valid (Java, Serenity, Cucumber)
Serenity cucumber show each step on console
Using Cucumber in spring boot Spring Boot BDD Testing with serenity
Springboot/Cucumber Integration-How to use @Autowired(or other SB tags) inside step definition class?
I cannot @Spy Object in Cucumber Spring Boot Test in two Steps Definitions
Spring @MockBean not injected with Cucumber
SpringBoot SpringApplicationBuilder
Spring Boot Loads Before Embedded Cassandra When Using Cucumber, How Can I Fix This?
Cucumber runner class initialised with error after upgrade from cucumber 4.2.3 to 5.1.3
Not able to configure Spring Boot with Cucumber having more than one step files
Cannot see cucumber snippets on logs
Cucumber + spring: How to trigger SmartLifecycle events through tests?
Library Mismatch Issue in Spring Boot
How to get JPA context in Springboot integration test?
Spring Boot + Cucumber test: cucumber cannot detect my step definition method due to double quotation escaping in JSON
Using Cucumber in spring Is it possible to configure cucumber to run the same test with different spring profiles?
load Spring aggregator parametrs dynamically for tests
Why are my cucumber tests cases getting skipped?
Cucumber specific scenario to run conditionally
How do I wire up the correct Spring context to my Cucumber tests?
Spring error in Cucumber java.lang.IllegalAccessError: tried to access class
Using Cucumber in testing How do I test a component were the output goes to a database using Cucumber?
Cucumber scenario outline with examples: Failed to create scenario runner
Cucumber steps - testing an EJB service with a persistence context
Run each cucumber test independently
Error NoSuchMethodError appears when testing cucumber
Using multiple classes in Cucumber glue option package
Using a list in a Cucumber data-table
How do I perform tag driven cross-browser testing in Cucumber for Java?
Cross browser testing in cucumber
How to add bearer token to retrofit request in Java
Why can't cucumber create step definition of bdd sentences that is end with ')' or '.'?
Cucumber - How to struct your tests steps?
Cannot define step definition in cucumber
How to specify source jar for Cucumber stepdef
CucumberOptions Java command line
Cannot get api hostname via System property in Java
How can I invoke @after once for many scenarios?
Using Cucumber in testng Snippet from Cucumber Java TestNG looks strange
WireMock always returns Connection Refused when run inside test
How to pass TestNG parameter into Cucumber?
Changing from info.cukes to io.cucumber with testNG Maven. Throwing runtime error
Configuring a Maven plugin twice in a pom.xml
How to pass parameter to testng xml through command line
Is there a screenshot > Report embed method for TestNG which is available for Cucumber?
Are annotations instance specific in java?
Using Cucumber in ui automation Dependency Injection - Cucumber Pico Container
How to run UI tests with different configuration in Maven
How to get webdriver to switch between using css, xpath, tag, link or element id
Using Cucumber in unit testing Using PowerMock with Cucumber
Unit testing for a Selenium project
Generate java test class from features in cucumber
Should we mock in cucumber testing while testing java code. Till what extent we should use cucumber?
Unit testing Exception scenarios with cucumber in java
Using Cucumber in web services Can we parameterize the request file name to the Read method in Karate?
BDD cucumber Web Service
Cucumber Test Step time of execution in Java
Using Cucumber in webdriver How to execute cucumber test cases in parallel using Grid?
debug logs when using cucumber with selenium webdriver in a play framework
How to create a step definition to handle dynamic data entry?
Minium is throwing error with glue and browser
How to open correctly a local file within Chrome using Selenium WebDriver and Cucumber?
Cucumber - Type mismatch: cannot convert from element type Map<Object,Object> to Map<String,String>
Selenium: Add WebElements to a List, then check visibility of all of them
How to skip all cucumber-jvm scenarios when first scenario is failed
Approach to automate verify large text file (logs) with cucumber from www site checked with selenium webdriver
How I can provide the click on a suggestions-result (dropdown menu) in wikipedia with a selenium test in java?
Execute Cucumber Test scenarios using Gradle
ChromeDriver cannot navigate to URL in eclipse
Navigate through search results page and find the link using selenium webdriver
How can I use the same chromedriver in multiple stepDefPages for multiple scenarios and without restarting my driver?
Why are multiple Browser instances opening when I am trying to run a single Test Case script in this case?
Why are my ExpectedConditions commands being ignored? Selenium WebDriver in Java
Cucumber Java with Selenium - Reuse and concat Login feature with other features
Cannot find classes in a package using Class.forName()
Java/SeleniumWebDriver: Focus Don't skip to Else If block when the warning message matches on webpage
Cucumber Java (Maven) WebdriverManager (Bonigarcia) Not able to get URL from properties
Cucumber: how can you create a BaseSteps class if you can’t use inheritance with Cucumber?
Unable to identify variable even though variable has been defined
Cucumber options (Command line) no longer works with newer version of cucumber (io.cucumber)?
Design issue in Cucumber spring WebDriver quit in @After method
How to verify all the elements in the same page using Data Table
Creating a method to increment a number within an email
Writing multiple data to Excel file
Opening files using selenium WebDriver when it's in the resources folder in a maven project
How to create a MasterStep / BaseStep if the my sub step files already extend a class?
Change Between Chrome and Firefox per Scenario in Selenium Java ( CUCUMBER , JUnit)
How to update Cucumber-JVM's --format option?
Selenium Webdriver: Automatically Repeating a successful scenario
Cucumber and TestNG Parameters conflict
Webdriver Manager
Can't run testng.xml in Cucumber-Maven(TestNG)
Start Webdriver separately in Selenium Cucumber-jvm
Cucumber Java with Selenium - Runnable Method is missing
Cucumber Scenario Outline Step Definitions
Unable to launch the browser using testng using beforeTest annotation
Cucumber cannot find StepDefinitions while running the code but manually using the option "Find Step" can find step definition
Cucumber and Selenium Error on Feature
Click in a specific element of list of web elements in Java selenium
Selenium WebDriver won't return correct title of Google results page
Can we use static Pojo methods when running tests concurrently?
Cross Browser Testing using Cucumber sequentially?
Multiple markers error when using System.setProperty in Cucumber Step Defination
How to create and write a module for automation test framework
Using Cucumber in windows In Cucumber, How to pass the location of the file path such that it works for both Windows and MAC
Windows, Gradle and Cucumber combination throws an IOException upon generating reports
Cucumber (Java) via Windows command line works via batch, but not pom
Using Cucumber in xpath How to get the list of items from the p tags
How to extract string from HTML by XPath into Java?
Searching for a string, then clicking the parent DIV with Selenium
Selenium, Java - Unable to locate element
XPath of French Characters
Cucumber/Selenium: Stopping a false positive with a try catch block
Selenium Extract the ID of an element found via text in Java